Rogers-n
type: LexicalEntry
canonical form: Rogers
sense: 11288513-n
part of speech: noun

Carl Rogers-n
type: LexicalEntry
canonical form: Carl Rogers
sense: 11288513-n
part of speech: noun

11288513-n
type: LexicalConcept
in scheme: en-word.net
definition: United States psychologist who developed client-centered therapy (1902-1987)
ili: i96744
lexfile: noun.person
part of speech: noun
instance hypernym: 10508450-n