Cape Breton Island-n
type: LexicalEntry
canonical form: Cape Breton Island
sense: 08845691-n
part of speech: noun

08845691-n
type: LexicalConcept
in scheme: en-word.net
definition: an island that forms the northeastern part of Nova Scotia
ili: i83220
lexfile: noun.location
part of speech: noun
instance hypernym: 09339360-n