Kolkata-n
type: LexicalEntry
canonical form: Kolkata
sense: 08923604-n
part of speech: noun

Calcutta-n
type: LexicalEntry
canonical form: Calcutta
sense: 08923604-n
part of speech: noun

08923604-n
type: LexicalConcept
in scheme: en-word.net
definition: the largest city in India and one of the largest cities in the world; located in eastern India; suffers from poverty and overcrowding
ili: i83529
lexfile: noun.location
part of speech: noun
instance hypernym: 08542298-n