Burundi-a
type: LexicalEntry
canonical form: Burundi
sense: https://en-word.net/lemma/Burundi-a#03063623-a
part of speech: adjective

Burundian-a
type: LexicalEntry
canonical form: Burundian
sense: https://en-word.net/lemma/Burundian-a#03063623-a
part of speech: adjective

https://en-word.net/synset/03063623-a
type: LexicalConcept
in scheme: en-word.net
definition: of or relating to or characteristic of Burundi or its people
example: the Burundi capital
ili: i17487
lexfile: adj.pert
part of speech: adjective

Burundian-n
type: LexicalEntry
canonical form: Burundian
sense: 09715267-n
part of speech: noun

09715267-n
type: LexicalConcept
in scheme: en-word.net
definition: a native or inhabitant of Burundi
ili: i87604
lexfile: noun.person
part of speech: noun
hypernym: 09657682-n