Burundi-a
type: LexicalEntry
canonical form: Burundi
sense: https://en-word.net/lemma/Burundi-a#03063623-a
part of speech: adjective

Burundian-a
type: LexicalEntry
canonical form: Burundian
sense: https://en-word.net/lemma/Burundian-a#03063623-a
part of speech: adjective

https://en-word.net/synset/03063623-a
type: LexicalConcept
in scheme: en-word.net
definition: of or relating to or characteristic of Burundi or its people
example: the Burundi capital
ili: i17487
lexfile: adj.pert
part of speech: adjective

Burundi-n
type: LexicalEntry
canonical form: Burundi
sense: 08734052-n
part of speech: noun

Republic of Burundi-n
type: LexicalEntry
canonical form: Republic of Burundi
sense: 08734052-n
part of speech: noun

08734052-n
type: LexicalConcept
in scheme: en-word.net
definition: a landlocked republic in east central Africa on the northeastern shore of Lake Tanganyika
ili: i82705
lexfile: noun.location
part of speech: noun
instance hypernym: 08716193-n
mero member: 09712496-n
mero member: 09713205-n
mero member: 09715267-n
mero part: 08734350-n