Wild West Show-n
type: LexicalEntry
canonical form: Wild West Show
sense: 00524319-n
part of speech: noun

Buffalo Bill's Wild West Show-n
type: LexicalEntry
canonical form: Buffalo Bill's Wild West Show
sense: 00524319-n
part of speech: noun

00524319-n
type: LexicalConcept
in scheme: en-word.net
definition: a spectacular show organized in 1883 by William F. Cody that featured horseback riding and marksmanship on a large scale; toured the United States and Europe
ili: i38139
lexfile: noun.act
part of speech: noun
hypernym: 00521313-n