Wroclaw-n
type: LexicalEntry
canonical form: Wroclaw
sense: 09006702-n
part of speech: noun

Breslau-n
type: LexicalEntry
canonical form: Breslau
sense: 09006702-n
part of speech: noun

09006702-n
type: LexicalConcept
in scheme: en-word.net
definition: a city in southwestern Poland on the Oder
ili: i83903
lexfile: noun.location
part of speech: noun
instance hypernym: 08542298-n