Bolzano-n
type: LexicalEntry
canonical form: Bolzano
sense: 08822514-n
part of speech: noun

08822514-n
type: LexicalConcept
in scheme: en-word.net
definition: an Italian city in Trentino-Alto Adige near the Austrian border; noted as a resort and for its Alpine scenery
ili: i83114
lexfile: noun.location
part of speech: noun
instance hypernym: 08542298-n