Bologna-n
type: LexicalEntry
canonical form: Bologna
sense: 08824310-n
part of speech: noun

08824310-n
type: LexicalConcept
in scheme: en-word.net
definition: the capital of Emilia-Romagna; located in northern Italy to the east of the Apennines
ili: i83124
lexfile: noun.location
part of speech: noun
instance hypernym: 08542298-n