Bloch-n
type: LexicalEntry
canonical form: Bloch
sense: 10873009-n
part of speech: noun

Ernest Bloch-n
type: LexicalEntry
canonical form: Ernest Bloch
sense: 10873009-n
part of speech: noun

10873009-n
type: LexicalConcept
in scheme: en-word.net
definition: United States composer (born in Switzerland) who composed symphonies and chamber music and choral music and a piano sonata and an opera (1880-1959)
ili: i94487
lexfile: noun.person
part of speech: noun
instance hypernym: 09966711-n