Black Sea-n
type: LexicalEntry
canonical form: Black Sea
sense: 09246232-n
part of speech: noun

Euxine Sea-n
type: LexicalEntry
canonical form: Euxine Sea
sense: 09246232-n
part of speech: noun

09246232-n
type: LexicalConcept
in scheme: en-word.net
definition: a sea between Europe and Asia; a popular resort area of eastern Europeans
ili: i85093
lexfile: noun.object
part of speech: noun
instance hypernym: 09449666-n
mero part: 09450754-n