Beverly Hills-n
type: LexicalEntry
canonical form: Beverly Hills
sense: 09085261-n
part of speech: noun

09085261-n
type: LexicalConcept
in scheme: en-word.net
definition: a city in southwestern California surrounded by Los Angeles; home of many Hollywood actors
ili: i84245
lexfile: noun.location
part of speech: noun
instance hypernym: 08542298-n