Belize-n
type: LexicalEntry
canonical form: Belize
sense: 08755354-n
part of speech: noun

British Honduras-n
type: LexicalEntry
canonical form: British Honduras
sense: 08755354-n
part of speech: noun

08755354-n
type: LexicalConcept
in scheme: en-word.net
definition: a country on the northeastern coast of Central America on the Caribbean; formerly under British control
ili: i82803
lexfile: noun.location
part of speech: noun
instance hypernym: 08720849-n