April-n
type: LexicalEntry
canonical form: April
sense: 15235985-n
part of speech: noun

Apr-n
type: LexicalEntry
canonical form: Apr
sense: 15235985-n
part of speech: noun

15235985-n
type: LexicalConcept
in scheme: en-word.net
definition: the month following March and preceding May
ili: i117158
lexfile: noun.time
part of speech: noun
hypernym: 15234502-n
mero part: 15213340-n
mero part: 15213523-n
mero part: 15213687-n
mero part: 15236181-n