Angora-n
type: LexicalEntry
canonical form: Angora
sense: 02420033-n
part of speech: noun

Angora goat-n
type: LexicalEntry
canonical form: Angora goat
sense: 02420033-n
part of speech: noun

02420033-n
type: LexicalConcept
in scheme: en-word.net
definition: a domestic breed of goat raised for its long silky hair which is the true mohair
ili: i48331
lexfile: noun.animal
part of speech: noun
hypernym: 02419716-n