Andes-n
type: LexicalEntry
canonical form: Andes
sense: 09219489-n
part of speech: noun

09219489-n
type: LexicalConcept
in scheme: en-word.net
definition: a mountain range in South America running 5000 miles along the Pacific coast
ili: i84968
lexfile: noun.object
part of speech: noun
instance hypernym: 09426609-n
mero part: 09210101-n
mero part: 09219180-n
mero part: 09249498-n
mero part: 09253407-n
mero part: 09266521-n
mero part: 09280186-n
mero part: 09295833-n
mero part: 09308734-n
mero part: 09329403-n
mero part: 09332917-n
mero part: 09333068-n
mero part: 09359608-n
mero part: 09364579-n
mero part: 09374154-n
mero part: 09387323-n
mero part: 09400569-n
mero part: 09415854-n
mero part: 09443151-n
mero part: 09486851-n
mero part: 09505696-n