Algiers-n
type: LexicalEntry
canonical form: Algiers
sense: 08723872-n
part of speech: noun

Algerian capital-n
type: LexicalEntry
canonical form: Algerian capital
sense: 08723872-n
part of speech: noun

08723872-n
type: LexicalConcept
in scheme: en-word.net
definition: an ancient port on the Mediterranean; the capital and largest city of Algeria
ili: i82652
lexfile: noun.location
part of speech: noun
instance hypernym: 08709407-n
instance hypernym: 08651532-n