Dreyfus-n
type: LexicalEntry
canonical form: Dreyfus
sense: 10963397-n
part of speech: noun

Alfred Dreyfus-n
type: LexicalEntry
canonical form: Alfred Dreyfus
sense: 10963397-n
part of speech: noun

10963397-n
type: LexicalConcept
in scheme: en-word.net
definition: French army officer of Jewish descent whose false imprisonment for treason in 1894 raised issues of anti-Semitism that dominated French politics until his release in 1906 (1859-1935)
ili: i94962
lexfile: noun.person
part of speech: noun
instance hypernym: 09829154-n