Carrel-n
type: LexicalEntry
canonical form: Carrel
sense: 10903440-n
part of speech: noun

Alexis Carrel-n
type: LexicalEntry
canonical form: Alexis Carrel
sense: 10903440-n
part of speech: noun

10903440-n
type: LexicalConcept
in scheme: en-word.net
definition: French surgeon and biologist who developed a way to suture and graft blood vessels (1873-1944)
ili: i94652
lexfile: noun.person
part of speech: noun
instance hypernym: 10698621-n
instance hypernym: 09875036-n