Aeschylus-n
type: LexicalEntry
canonical form: Aeschylus
sense: 10828690-n
part of speech: noun

10828690-n
type: LexicalConcept
in scheme: en-word.net
definition: Greek tragedian; the father of Greek tragic drama (525-456 BC)
ili: i94249
lexfile: noun.person
part of speech: noun
instance hypernym: 10050002-n